Talk:Building OpenCog on Mac OS X with MacPorts

From OpenCog
Jump to: navigation, search
$ make test
[  3%] Built target cogutil
[ 11%] Built target comboreduct
[ 11%] Built target AvatarComboVocabulary
[ 11%] Built target HPASearch
[ 13%] Built target TangentBug
[ 13%] Built target AStar
[ 13%] Built target Control
[ 13%] Built target LearningSpace
[ 13%] Built target opencog_atom_types
[ 15%] Built target smob
[ 21%] Built target atomspace
[ 22%] Built target xml
[ 23%] Built target server
[ 27%] Built target SpaceMap
[ 29%] Built target spacetime
[ 33%] Built target MessagingSystem
[ 34%] Built target embodiment_atom_types
[ 35%] Built target query
[ 35%] Built target AtomSpaceExtensions
[ 36%] Built target LearningServerMessages
[ 36%] Built target Language
[ 39%] Built target PAI
[ 41%] Built target behavior
[ 41%] Built target ImaginaryLife
[ 42%] Built target WorldWrapper
[ 42%] Built target WorldWrapperUtilCacheUTest
[ 42%] Built target lru_cacheUTest
[ 42%] Built target lazy_selectorUTest
[ 42%] Built target ConfigUTest
[ 42%] Built target LoggerUTest
[ 42%] Built target iostreamContainerUTest
[ 42%] Built target StringTokenizerUTest
[ 42%] Built target numericUTest
[ 42%] Built target functionalUTest
[ 42%] Built target KLDUTest
[ 42%] Built target randomUTest
[ 42%] Built target comprehensionUTest
[ 42%] Built target CounterUTest
[ 42%] Built target rankingUTest
[ 42%] Built target AtomTableUTest
[ 42%] Built target ClassServerUTest
[ 42%] Built target AtomUTest
[ 42%] Built target NodeUTest
[ 44%] Built target LinkUTest
[ 44%] Built target TruthValueUTest
[ 45%] Built target SimpleTruthValueUTest
[ 45%] Built target IndefiniteTruthValueUTest
[ 46%] Built target savable
[ 46%] Built target CompositeTruthValueUTest
[ 47%] Built target AttentionValueUTest
[ 47%] Built target AtomSpaceUTest
[ 48%] Built target AtomSpaceImplUTest
[ 50%] Built target AtomSpaceAsyncUTest
[ 50%] Built target HandleEntryUTest
[ 50%] Built target HandleMapUTest
[ 50%] Built target HandleSetUTest
[ 50%] Built target TLBUTest
[ 50%] Built target BasicSCMUTest
[ 51%] Built target SCMPrimitiveUTest
[ 51%] Built target PatternUTest
[ 52%] Built target StackUTest
[ 52%] Built target BigPatternUTest
[ 52%] Built target BiggerPatternUTest
[ 52%] Built target LoopPatternUTest
[ 52%] Built target BooleanUTest
[ 53%] Built target Boolean2NotUTest
[ 53%] Built target ImplicationUTest
[ 54%] Built target ExecutionUTest
[ 55%] Built target BuggyStackUTest
[ 57%] Built target VarTypeNotUTest
[ 58%] Built target MatchLinkUTest
[ 58%] Built target UnorderedUTest
[ 58%] Built target StackMoreUTest
[ 58%] Built target CogServerUTest
[ 58%] Built target AgentUTest
[ 58%] Built target VisibilityMapUTest
[ 59%] Built target HPASearchUTest
[ 59%] Built target MathUTest
[ 59%] Built target TemporalUTest
[ 59%] Built target TemporalMapUTest
[ 59%] Built target TemporalTableUTest
[ 60%] Built target TimeServerUTest
[ 61%] Built target attention
[ 63%] Built target ForgettingAgentUTest
[ 64%] Built target HebbianUpdatingAgentUTest
[ 65%] Built target ImportanceUpdatingAgentUTest
[ 65%] Built target ImportanceDiffusionAgentUTest
[ 65%] Built target STIDecayingAgentUTest
[ 66%] Built target annUTest
[ 66%] Built target vertexUTest
[ 66%] Built target messageUTest
[ 66%] Built target type_treeUTest
[ 67%] Built target variable_unifierUTest
[ 69%] Built target procedure_callUTest
[ 69%] Built target procedure_repositoryUTest
[ 69%] Built target evalUTest
[ 69%] Built target tableUTest
[ 70%] Built target listUTest
[ 70%] Built target BooleanReductUTest
[ 70%] Built target BooleanFullUTest
[ 71%] Built target ContinReductUTest
[ 71%] Built target FullReductUTest
[ 71%] Built target MixedReductUTest
[ 71%] Built target ANNReductUTest
[ 71%] Built target FoldReductUTest
[ 72%] Built target feature_selection
[ 75%] Built target moses
[ 75%] Built target KnobTurningUTest
[ 75%] Built target NeighborSamplingUTest
[ 75%] Built target FieldSetUTest
[ 76%] Built target representationUTest
[ 76%] Built target moses_exec
[ 76%] Built target MOSESUTest
[ 77%] Built target mixedUTest
[ 77%] Built target optimizationUTest
[ 77%] Built target metapopulationUTest
[ 77%] Built target iostream_bscored_combo_treeUTest
[ 77%] Built target feature_selectionUTest
[ 77%] Built target dimensionalembedding
[ 77%] Built target DimEmbedUTest
[ 77%] Built target RouterMessageUTest
[ 77%] Built target FileMessageCentralUTest
[ 77%] Built target MemoryMessageCentralUTest
[ 77%] Built target StringMessageUTest
[ 79%] Built target Procedure
[ 79%] Built target FitnessEstimator
[ 80%] Built target RewritingRules
[ 80%] Built target PetaverseHC
[ 82%] Built target PetaverseMOSES
[ 83%] Built target lslib
[ 84%] Built target Filter
[ 84%] Built target learningServer
[ 85%] Built target PBTester
[ 85%] Built target pbTest
[ 85%] Built target router
[ 85%] Built target spawner
[ 86%] Built target json_spirit
[ 88%] Built target PredicateUpdaters
[ 92%] Built target oac
[ 92%] Built target oac-exec
[ 92%] Built target opcHcTester
[ 92%] Built target combo_shell_stdio
[ 92%] Built target combo_shell
Putting distribution files into ../../bin/dist/Embodiment
Using config file ../../opencog/embodiment/dev_embodiment.conf.example
[ 92%] Built target DistributeOACStuff
[ 92%] Built target oacmock
[ 92%] Built target PsiDemandUpdaterAgentUTest
[ 94%] Built target PsiModulatorUpdaterAgentUTest
[ 94%] Built target PsiFeelingUpdaterAgentUTest
[ 94%] Built target PsiActionSelectionAgentUTest
[ 94%] Built target ActionPlanUTest
[ 94%] Built target ActionTypeUTest
[ 95%] Built target ActionParamTypeUTest
[ 95%] Built target PetActionUTest
[ 95%] Built target RunningComboProcedureUTest
[ 96%] Built target ComboProcedureRepositoryUTest
[ 97%] Built target BehaviorDescriptionMatcherUTest
[ 97%] Built target CompositeBehaviorDescriptionUTest
[ 97%] Built target BehaviorCategoryUTest
[ 98%] Built target BDRetrieverUTest
[ 98%] Built target BEUTest
[ 98%] Built target RewardMessageUTest
[ 98%] Built target SchemaMessageUTest
[100%] Built target NeighborhoodGeneratorUTest
[100%] Built target SetopsUTest
[100%] Built target tests
Scanning dependencies of target test
[100%] Running tests...
Test project /Users/dhart/opencog/bin/tests
        Start   1: ConfigUTest
  1/113 Test   #1: ConfigUTest .........................   Passed    0.34 sec
        Start   2: LoggerUTest
  2/113 Test   #2: LoggerUTest .........................   Passed    0.05 sec
        Start   3: StringTokenizerUTest
  3/113 Test   #3: StringTokenizerUTest ................   Passed    0.02 sec
        Start   4: lazy_selectorUTest
  4/113 Test   #4: lazy_selectorUTest ..................   Passed    0.02 sec
        Start   5: lru_cacheUTest
  5/113 Test   #5: lru_cacheUTest ......................   Passed    0.02 sec
        Start   6: iostreamContainerUTest
  6/113 Test   #6: iostreamContainerUTest ..............   Passed    0.03 sec
        Start   7: numericUTest
  7/113 Test   #7: numericUTest ........................   Passed    0.01 sec
        Start   8: functionalUTest
  8/113 Test   #8: functionalUTest .....................   Passed    0.01 sec
        Start   9: KLDUTest
  9/113 Test   #9: KLDUTest ............................   Passed    4.44 sec
        Start  10: randomUTest
 10/113 Test  #10: randomUTest .........................   Passed    0.92 sec
        Start  11: comprehensionUTest
 11/113 Test  #11: comprehensionUTest ..................   Passed    0.08 sec
        Start  12: CounterUTest
 12/113 Test  #12: CounterUTest ........................   Passed    0.04 sec
        Start  13: rankingUTest
 13/113 Test  #13: rankingUTest ........................   Passed    0.02 sec
        Start  14: AtomTableUTest
 14/113 Test  #14: AtomTableUTest ......................   Passed    0.24 sec
        Start  15: ClassServerUTest
 15/113 Test  #15: ClassServerUTest ....................   Passed    0.03 sec
        Start  16: AtomUTest
 16/113 Test  #16: AtomUTest ...........................   Passed    0.02 sec
        Start  17: NodeUTest
 17/113 Test  #17: NodeUTest ...........................   Passed    0.02 sec
        Start  18: LinkUTest
 18/113 Test  #18: LinkUTest ...........................   Passed    0.02 sec
        Start  19: TruthValueUTest
 19/113 Test  #19: TruthValueUTest .....................   Passed    0.03 sec
        Start  20: SimpleTruthValueUTest
 20/113 Test  #20: SimpleTruthValueUTest ...............   Passed    0.02 sec
        Start  21: IndefiniteTruthValueUTest
 21/113 Test  #21: IndefiniteTruthValueUTest ...........   Passed    0.04 sec
        Start  22: CompositeTruthValueUTest
 22/113 Test  #22: CompositeTruthValueUTest ............***Exception: Other  0.88 sec
        Start  23: AttentionValueUTest
 23/113 Test  #23: AttentionValueUTest .................   Passed    0.10 sec
        Start  24: AtomSpaceUTest
 24/113 Test  #24: AtomSpaceUTest ......................   Passed    0.03 sec
        Start  25: AtomSpaceImplUTest
 25/113 Test  #25: AtomSpaceImplUTest ..................   Passed    0.03 sec
        Start  26: AtomSpaceAsyncUTest
 26/113 Test  #26: AtomSpaceAsyncUTest .................   Passed    0.10 sec
        Start  27: HandleEntryUTest
 27/113 Test  #27: HandleEntryUTest ....................   Passed    0.03 sec
        Start  28: HandleMapUTest
 28/113 Test  #28: HandleMapUTest ......................   Passed    0.03 sec
        Start  29: HandleSetUTest
 29/113 Test  #29: HandleSetUTest ......................   Passed    0.02 sec
        Start  30: TLBUTest
 30/113 Test  #30: TLBUTest ............................   Passed    0.02 sec
        Start  31: BasicSCMUTest
 31/113 Test  #31: BasicSCMUTest .......................***Exception: Other  0.26 sec
        Start  32: SCMPrimitiveUTest
 32/113 Test  #32: SCMPrimitiveUTest ...................***Exception: Other  0.21 sec
        Start  33: PatternUTest
 33/113 Test  #33: PatternUTest ........................***Exception: Other  0.23 sec
        Start  34: StackUTest
 34/113 Test  #34: StackUTest ..........................   Passed    0.03 sec
        Start  35: BigPatternUTest
 35/113 Test  #35: BigPatternUTest .....................   Passed    0.02 sec
        Start  36: BiggerPatternUTest
 36/113 Test  #36: BiggerPatternUTest ..................***Exception: Other  0.23 sec
        Start  37: LoopPatternUTest
 37/113 Test  #37: LoopPatternUTest ....................   Passed    0.02 sec
        Start  38: BooleanUTest
 38/113 Test  #38: BooleanUTest ........................***Exception: Other  0.24 sec
        Start  39: Boolean2NotUTest
 39/113 Test  #39: Boolean2NotUTest ....................***Exception: Other  0.31 sec
        Start  40: ImplicationUTest
 40/113 Test  #40: ImplicationUTest ....................***Exception: Other  0.25 sec
        Start  41: ExecutionUTest
 41/113 Test  #41: ExecutionUTest ......................***Exception: Other  0.22 sec
        Start  42: BuggyStackUTest
 42/113 Test  #42: BuggyStackUTest .....................***Exception: Other  0.24 sec
        Start  43: VarTypeNotUTest
 43/113 Test  #43: VarTypeNotUTest .....................***Exception: Other  0.22 sec
        Start  44: MatchLinkUTest
 44/113 Test  #44: MatchLinkUTest ......................***Exception: Other  0.23 sec
        Start  45: UnorderedUTest
 45/113 Test  #45: UnorderedUTest ......................***Exception: Other  0.22 sec
        Start  46: StackMoreUTest
 46/113 Test  #46: StackMoreUTest ......................***Exception: Other  0.22 sec
        Start  47: CogServerUTest
 47/113 Test  #47: CogServerUTest ......................   Passed    5.88 sec
        Start  48: AgentUTest
 48/113 Test  #48: AgentUTest ..........................   Passed    0.06 sec
        Start  49: VisibilityMapUTest
 49/113 Test  #49: VisibilityMapUTest ..................***Exception: Other  3.56 sec
        Start  50: HPASearchUTest
 50/113 Test  #50: HPASearchUTest ......................***Exception: Other  0.41 sec
        Start  51: MathUTest
 51/113 Test  #51: MathUTest ...........................***Exception: Other  0.26 sec
        Start  52: TemporalUTest
 52/113 Test  #52: TemporalUTest .......................***Exception: Other  0.25 sec
        Start  53: TemporalMapUTest
 53/113 Test  #53: TemporalMapUTest ....................***Exception: Other  0.25 sec
        Start  54: TemporalTableUTest
 54/113 Test  #54: TemporalTableUTest ..................***Exception: Other  0.26 sec
        Start  55: TimeServerUTest
 55/113 Test  #55: TimeServerUTest .....................***Exception: Other  0.29 sec
        Start  56: RESTfulTest
 56/113 Test  #56: RESTfulTest .........................***Failed   11.14 sec
        Start  57: ForgettingAgentUTest
 57/113 Test  #57: ForgettingAgentUTest ................   Passed    0.26 sec
        Start  58: HebbianUpdatingAgentUTest
 58/113 Test  #58: HebbianUpdatingAgentUTest ...........   Passed    0.04 sec
        Start  59: ImportanceUpdatingAgentUTest
 59/113 Test  #59: ImportanceUpdatingAgentUTest ........   Passed    0.07 sec
        Start  60: ImportanceDiffusionAgentUTest
 60/113 Test  #60: ImportanceDiffusionAgentUTest .......   Passed    0.04 sec
        Start  61: STIDecayingAgentUTest
 61/113 Test  #61: STIDecayingAgentUTest ...............   Passed    0.03 sec
        Start  62: annUTest
 62/113 Test  #62: annUTest ............................   Passed    0.02 sec
        Start  63: vertexUTest
 63/113 Test  #63: vertexUTest .........................   Passed    0.01 sec
        Start  64: messageUTest
 64/113 Test  #64: messageUTest ........................   Passed    0.02 sec
        Start  65: type_treeUTest
 65/113 Test  #65: type_treeUTest ......................   Passed    0.04 sec
        Start  66: variable_unifierUTest
 66/113 Test  #66: variable_unifierUTest ...............   Passed    0.02 sec
        Start  67: procedure_callUTest
 67/113 Test  #67: procedure_callUTest .................   Passed    0.01 sec
        Start  68: procedure_repositoryUTest
 68/113 Test  #68: procedure_repositoryUTest ...........   Passed    0.02 sec
        Start  69: evalUTest
 69/113 Test  #69: evalUTest ...........................   Passed    0.01 sec
        Start  70: tableUTest
 70/113 Test  #70: tableUTest ..........................   Passed    0.06 sec
        Start  71: listUTest
 71/113 Test  #71: listUTest ...........................   Passed    0.02 sec
        Start  72: BooleanReductUTest
 72/113 Test  #72: BooleanReductUTest ..................   Passed    0.04 sec
        Start  73: BooleanFullUTest
 73/113 Test  #73: BooleanFullUTest ....................   Passed    0.74 sec
        Start  74: ContinReductUTest
 74/113 Test  #74: ContinReductUTest ...................   Passed    0.12 sec
        Start  75: FullReductUTest
 75/113 Test  #75: FullReductUTest .....................   Passed    0.05 sec
        Start  76: MixedReductUTest
 76/113 Test  #76: MixedReductUTest ....................   Passed    0.26 sec
        Start  77: ANNReductUTest
 77/113 Test  #77: ANNReductUTest ......................   Passed    0.03 sec
        Start  78: FoldReductUTest
 78/113 Test  #78: FoldReductUTest .....................   Passed    0.01 sec
        Start  79: KnobTurningUTest
 79/113 Test  #79: KnobTurningUTest ....................   Passed    0.07 sec
        Start  80: NeighborSamplingUTest
 80/113 Test  #80: NeighborSamplingUTest ...............   Passed    0.05 sec
        Start  81: FieldSetUTest
 81/113 Test  #81: FieldSetUTest .......................   Passed    0.24 sec
        Start  82: representationUTest
 82/113 Test  #82: representationUTest .................   Passed    0.52 sec
        Start  83: MOSESUTest
 83/113 Test  #83: MOSESUTest ..........................   Passed   38.30 sec
        Start  84: mixedUTest
 84/113 Test  #84: mixedUTest ..........................   Passed   48.31 sec
        Start  85: optimizationUTest
 85/113 Test  #85: optimizationUTest ...................   Passed    0.06 sec
        Start  86: metapopulationUTest
 86/113 Test  #86: metapopulationUTest .................   Passed    0.05 sec
        Start  87: iostream_bscored_combo_treeUTest
 87/113 Test  #87: iostream_bscored_combo_treeUTest ....   Passed    0.03 sec
        Start  88: feature_selectionUTest
 88/113 Test  #88: feature_selectionUTest ..............***Exception: Other  0.31 sec
        Start  89: DimEmbedUTest
 89/113 Test  #89: DimEmbedUTest .......................   Passed    0.12 sec
        Start  90: RouterMessageUTest
 90/113 Test  #90: RouterMessageUTest ..................   Passed    0.06 sec
        Start  91: FileMessageCentralUTest
 91/113 Test  #91: FileMessageCentralUTest .............***Exception: Other  0.26 sec
        Start  92: MemoryMessageCentralUTest
 92/113 Test  #92: MemoryMessageCentralUTest ...........   Passed    1.35 sec
        Start  93: StringMessageUTest
 93/113 Test  #93: StringMessageUTest ..................   Passed    0.05 sec
        Start  94: PsiDemandUpdaterAgentUTest
 94/113 Test  #94: PsiDemandUpdaterAgentUTest ..........***Exception: SegFault  1.72 sec
        Start  95: PsiModulatorUpdaterAgentUTest
 95/113 Test  #95: PsiModulatorUpdaterAgentUTest .......***Exception: SegFault  0.76 sec
        Start  96: PsiFeelingUpdaterAgentUTest
 96/113 Test  #96: PsiFeelingUpdaterAgentUTest .........***Exception: SegFault  0.79 sec
        Start  97: PsiActionSelectionAgentUTest
 97/113 Test  #97: PsiActionSelectionAgentUTest ........***Exception: SegFault  0.75 sec
        Start  98: ActionPlanUTest
 98/113 Test  #98: ActionPlanUTest .....................   Passed    0.12 sec
        Start  99: ActionTypeUTest
 99/113 Test  #99: ActionTypeUTest .....................   Passed    0.05 sec
        Start 100: ActionParamTypeUTest
100/113 Test #100: ActionParamTypeUTest ................   Passed    0.06 sec
        Start 101: PetActionUTest
101/113 Test #101: PetActionUTest ......................   Passed    0.04 sec
        Start 102: RunningComboProcedureUTest
102/113 Test #102: RunningComboProcedureUTest ..........   Passed    0.07 sec
        Start 103: ComboProcedureRepositoryUTest
103/113 Test #103: ComboProcedureRepositoryUTest .......   Passed    0.07 sec
        Start 104: SetopsUTest
104/113 Test #104: SetopsUTest .........................   Passed    0.03 sec
        Start 105: BehaviorDescriptionMatcherUTest
105/113 Test #105: BehaviorDescriptionMatcherUTest .....   Passed    0.06 sec
        Start 106: CompositeBehaviorDescriptionUTest
106/113 Test #106: CompositeBehaviorDescriptionUTest ...   Passed    0.05 sec
        Start 107: BehaviorCategoryUTest
107/113 Test #107: BehaviorCategoryUTest ...............   Passed    0.04 sec
        Start 108: BDRetrieverUTest
108/113 Test #108: BDRetrieverUTest ....................   Passed    0.04 sec
        Start 109: BEUTest
109/113 Test #109: BEUTest .............................***Exception: Other  0.46 sec
        Start 110: RewardMessageUTest
110/113 Test #110: RewardMessageUTest ..................   Passed    0.05 sec
        Start 111: SchemaMessageUTest
111/113 Test #111: SchemaMessageUTest ..................   Passed    0.04 sec
        Start 112: NeighborhoodGeneratorUTest
112/113 Test #112: NeighborhoodGeneratorUTest ..........   Passed    0.05 sec
        Start 113: WorldWrapperUtilCacheUTest
113/113 Test #113: WorldWrapperUtilCacheUTest ..........   Passed    0.06 sec

74% tests passed, 29 tests failed out of 113

Total Test time (real) = 130.22 sec

The following tests FAILED:
	 22 - CompositeTruthValueUTest (OTHER_FAULT)
	 31 - BasicSCMUTest (OTHER_FAULT)
	 32 - SCMPrimitiveUTest (OTHER_FAULT)
	 33 - PatternUTest (OTHER_FAULT)
	 36 - BiggerPatternUTest (OTHER_FAULT)
	 38 - BooleanUTest (OTHER_FAULT)
	 39 - Boolean2NotUTest (OTHER_FAULT)
	 40 - ImplicationUTest (OTHER_FAULT)
	 41 - ExecutionUTest (OTHER_FAULT)
	 42 - BuggyStackUTest (OTHER_FAULT)
	 43 - VarTypeNotUTest (OTHER_FAULT)
	 44 - MatchLinkUTest (OTHER_FAULT)
	 45 - UnorderedUTest (OTHER_FAULT)
	 46 - StackMoreUTest (OTHER_FAULT)
	 49 - VisibilityMapUTest (OTHER_FAULT)
	 50 - HPASearchUTest (OTHER_FAULT)
	 51 - MathUTest (OTHER_FAULT)
	 52 - TemporalUTest (OTHER_FAULT)
	 53 - TemporalMapUTest (OTHER_FAULT)
	 54 - TemporalTableUTest (OTHER_FAULT)
	 55 - TimeServerUTest (OTHER_FAULT)
	 56 - RESTfulTest (Failed)
	 88 - feature_selectionUTest (OTHER_FAULT)
	 91 - FileMessageCentralUTest (OTHER_FAULT)
	 94 - PsiDemandUpdaterAgentUTest (SEGFAULT)
	 95 - PsiModulatorUpdaterAgentUTest (SEGFAULT)
	 96 - PsiFeelingUpdaterAgentUTest (SEGFAULT)
	 97 - PsiActionSelectionAgentUTest (SEGFAULT)
	109 - BEUTest (OTHER_FAULT)
Errors while running CTest
make[3]: *** [CMakeFiles/test] Error 8
make[2]: *** [CMakeFiles/test.dir/all] Error 2
make[1]: *** [CMakeFiles/test.dir/rule] Error 2
make: *** [test] Error 2

dhart (talk) 00:03, 21 January 2013 (CST)dhart